{"text_format":"1","workbook":"xlsx","n_sheets":2,"sheets":["IE抽出","difficulty"],"not_rendered":{"charts":0,"images":0,"macros":1,"external_links":0,"defined_names":0,"comments":0,"pivot_tables":0},"unopened":[],"bounds":{"document_bytes":16777216,"sheet_cells":100000,"rows_first":2000,"rows_last":500,"rows_between":2000,"halvings":0,"cell_chars":16384,"cell_head_chars":4096},"cells_cut":0,"cells_raw":0,"read":"whole","date_system":"1900"}

{"sheet":"IE抽出","index":0,"n_rows":31,"n_cols":18,"rows_kept":31,"cut":false,"hidden":false,"merged":[[4,12,4,14],[4,15,4,17],[1,9,1,10],[2,9,2,10],[1,11,1,12],[2,11,2,12],[1,3,1,5],[1,6,1,8],[2,4,2,5],[2,7,2,8],[4,3,4,5],[4,6,4,8]]}
[null,"Ver.161118"]
[null,"※ボタン押す前にIEでログイン",null,"Tri-BOOST",null,null,"Tri-BOOST Re:EVOLVE",null,null,"Skillの差",null,"評価"]
[null,null,null,"Skill",{"$f":"SUM(D7:D31,M7:M31)","v":0},null,"Skill",{"$f":"SUM(G7:G31,P7:P31)","v":0},null,{"$f":"H3-E3","v":0},null,{"$f":"IF(J3=0,\"\",IF(J3<0,\"アワレｗ\",\"やったぜ！\"))","v":""}]
[]
[null,null,null,"Tri-BOOST",null,null,"Tri-BOOST Re:EVOLVE",null,null,null,null,null,"Tri-BOOST",null,null,"Tri-BOOST Re:EVOLVE"]
[null,"HOT枠","PART","曲別スキル","達成率","難易度値","曲別スキル","達成率","難易度値",null,"OTHER枠","PART","曲別スキル","達成率","難易度値","曲別スキル","達成率","難易度値"]
[null,null,null,null,null,null,{"$f":"IF(E7=\"\",\"\",H7*I7*20)","v":""},{"$f":"IF(E7=\"\",\"\",E7)","v":""},{"$f":"IF(B7=\"\",\"\",VLOOKUP(B7,difficulty!$A$3:$M$849,IF(LEFT(C7,6)=\"GUITAR\",2,IF(LEFT(C7,4)=\"BASS\",6,10))+IF(RIGHT(C7,6)=\"MASTER\",3,IF(RIGHT(C7,7)=\"EXTREME\",2,IF(RIGHT(C7,8)=\"ADVANCED\",1,0))),0)/100)","v":""},null,null,null,null,null,null,{"$f":"IF(N7=\"\",\"\",Q7*R7*20)","v":""},{"$f":"IF(N7=\"\",\"\",N7)","v":""},{"$f":"IF(K7=\"\",\"\",VLOOKUP(K7,difficulty!$A$3:$M$849,IF(LEFT(L7,6)=\"GUITAR\",2,IF(LEFT(L7,4)=\"BASS\",6,10))+IF(RIGHT(L7,6)=\"MASTER\",3,IF(RIGHT(L7,7)=\"EXTREME\",2,IF(RIGHT(L7,8)=\"ADVANCED\",1,0))),0)/100)","v":""}]
[null,null,null,null,null,null,{"$f":"IF(E8=\"\",\"\",H8*I8*20)","v":""},{"$f":"IF(E8=\"\",\"\",E8)","v":""},{"$f":"IF(B8=\"\",\"\",VLOOKUP(B8,difficulty!$A$3:$M$849,IF(LEFT(C8,6)=\"GUITAR\",2,IF(LEFT(C8,4)=\"BASS\",6,10))+IF(RIGHT(C8,6)=\"MASTER\",3,IF(RIGHT(C8,7)=\"EXTREME\",2,IF(RIGHT(C8,8)=\"ADVANCED\",1,0))),0)/100)","v":""},null,null,null,null,null,null,{"$f":"IF(N8=\"\",\"\",Q8*R8*20)","v":""},{"$f":"IF(N8=\"\",\"\",N8)","v":""},{"$f":"IF(K8=\"\",\"\",VLOOKUP(K8,difficulty!$A$3:$M$849,IF(LEFT(L8,6)=\"GUITAR\",2,IF(LEFT(L8,4)=\"BASS\",6,10))+IF(RIGHT(L8,6)=\"MASTER\",3,IF(RIGHT(L8,7)=\"EXTREME\",2,IF(RIGHT(L8,8)=\"ADVANCED\",1,0))),0)/100)","v":""}]
[null,null,null,null,null,null,"","",{"$f":"IF(B9=\"\",\"\",VLOOKUP(B9,difficulty!$A$3:$M$849,IF(LEFT(C9,6)=\"GUITAR\",2,IF(LEFT(C9,4)=\"BASS\",6,10))+IF(RIGHT(C9,6)=\"MASTER\",3,IF(RIGHT(C9,7)=\"EXTREME\",2,IF(RIGHT(C9,8)=\"ADVANCED\",1,0))),0)/100)","v":""},null,null,null,null,null,null,"","",{"$f":"IF(K9=\"\",\"\",VLOOKUP(K9,difficulty!$A$3:$M$849,IF(LEFT(L9,6)=\"GUITAR\",2,IF(LEFT(L9,4)=\"BASS\",6,10))+IF(RIGHT(L9,6)=\"MASTER\",3,IF(RIGHT(L9,7)=\"EXTREME\",2,IF(RIGHT(L9,8)=\"ADVANCED\",1,0))),0)/100)","v":""}]
[null,null,null,null,null,null,"","",{"$f":"IF(B10=\"\",\"\",VLOOKUP(B10,difficulty!$A$3:$M$849,IF(LEFT(C10,6)=\"GUITAR\",2,IF(LEFT(C10,4)=\"BASS\",6,10))+IF(RIGHT(C10,6)=\"MASTER\",3,IF(RIGHT(C10,7)=\"EXTREME\",2,IF(RIGHT(C10,8)=\"ADVANCED\",1,0))),0)/100)","v":""},null,null,null,null,null,null,"","",{"$f":"IF(K10=\"\",\"\",VLOOKUP(K10,difficulty!$A$3:$M$849,IF(LEFT(L10,6)=\"GUITAR\",2,IF(LEFT(L10,4)=\"BASS\",6,10))+IF(RIGHT(L10,6)=\"MASTER\",3,IF(RIGHT(L10,7)=\"EXTREME\",2,IF(RIGHT(L10,8)=\"ADVANCED\",1,0))),0)/100)","v":""}]
[null,null,null,null,null,null,"","",{"$f":"IF(B11=\"\",\"\",VLOOKUP(B11,difficulty!$A$3:$M$849,IF(LEFT(C11,6)=\"GUITAR\",2,IF(LEFT(C11,4)=\"BASS\",6,10))+IF(RIGHT(C11,6)=\"MASTER\",3,IF(RIGHT(C11,7)=\"EXTREME\",2,IF(RIGHT(C11,8)=\"ADVANCED\",1,0))),0)/100)","v":""},null,null,null,null,null,null,"","",{"$f":"IF(K11=\"\",\"\",VLOOKUP(K11,difficulty!$A$3:$M$849,IF(LEFT(L11,6)=\"GUITAR\",2,IF(LEFT(L11,4)=\"BASS\",6,10))+IF(RIGHT(L11,6)=\"MASTER\",3,IF(RIGHT(L11,7)=\"EXTREME\",2,IF(RIGHT(L11,8)=\"ADVANCED\",1,0))),0)/100)","v":""}]
[null,null,null,null,null,null,"","",{"$f":"IF(B12=\"\",\"\",VLOOKUP(B12,difficulty!$A$3:$M$849,IF(LEFT(C12,6)=\"GUITAR\",2,IF(LEFT(C12,4)=\"BASS\",6,10))+IF(RIGHT(C12,6)=\"MASTER\",3,IF(RIGHT(C12,7)=\"EXTREME\",2,IF(RIGHT(C12,8)=\"ADVANCED\",1,0))),0)/100)","v":""},null,null,null,null,null,null,"","",{"$f":"IF(K12=\"\",\"\",VLOOKUP(K12,difficulty!$A$3:$M$849,IF(LEFT(L12,6)=\"GUITAR\",2,IF(LEFT(L12,4)=\"BASS\",6,10))+IF(RIGHT(L12,6)=\"MASTER\",3,IF(RIGHT(L12,7)=\"EXTREME\",2,IF(RIGHT(L12,8)=\"ADVANCED\",1,0))),0)/100)","v":""}]
[null,null,null,null,null,null,"","",{"$f":"IF(B13=\"\",\"\",VLOOKUP(B13,difficulty!$A$3:$M$849,IF(LEFT(C13,6)=\"GUITAR\",2,IF(LEFT(C13,4)=\"BASS\",6,10))+IF(RIGHT(C13,6)=\"MASTER\",3,IF(RIGHT(C13,7)=\"EXTREME\",2,IF(RIGHT(C13,8)=\"ADVANCED\",1,0))),0)/100)","v":""},null,null,null,null,null,null,"","",{"$f":"IF(K13=\"\",\"\",VLOOKUP(K13,difficulty!$A$3:$M$849,IF(LEFT(L13,6)=\"GUITAR\",2,IF(LEFT(L13,4)=\"BASS\",6,10))+IF(RIGHT(L13,6)=\"MASTER\",3,IF(RIGHT(L13,7)=\"EXTREME\",2,IF(RIGHT(L13,8)=\"ADVANCED\",1,0))),0)/100)","v":""}]
[null,null,null,null,null,null,"","",{"$f":"IF(B14=\"\",\"\",VLOOKUP(B14,difficulty!$A$3:$M$849,IF(LEFT(C14,6)=\"GUITAR\",2,IF(LEFT(C14,4)=\"BASS\",6,10))+IF(RIGHT(C14,6)=\"MASTER\",3,IF(RIGHT(C14,7)=\"EXTREME\",2,IF(RIGHT(C14,8)=\"ADVANCED\",1,0))),0)/100)","v":""},null,null,null,null,null,null,"","",{"$f":"IF(K14=\"\",\"\",VLOOKUP(K14,difficulty!$A$3:$M$849,IF(LEFT(L14,6)=\"GUITAR\",2,IF(LEFT(L14,4)=\"BASS\",6,10))+IF(RIGHT(L14,6)=\"MASTER\",3,IF(RIGHT(L14,7)=\"EXTREME\",2,IF(RIGHT(L14,8)=\"ADVANCED\",1,0))),0)/100)","v":""}]
[null,null,null,null,null,null,"","",{"$f":"IF(B15=\"\",\"\",VLOOKUP(B15,difficulty!$A$3:$M$849,IF(LEFT(C15,6)=\"GUITAR\",2,IF(LEFT(C15,4)=\"BASS\",6,10))+IF(RIGHT(C15,6)=\"MASTER\",3,IF(RIGHT(C15,7)=\"EXTREME\",2,IF(RIGHT(C15,8)=\"ADVANCED\",1,0))),0)/100)","v":""},null,null,null,null,null,null,"","",{"$f":"IF(K15=\"\",\"\",VLOOKUP(K15,difficulty!$A$3:$M$849,IF(LEFT(L15,6)=\"GUITAR\",2,IF(LEFT(L15,4)=\"BASS\",6,10))+IF(RIGHT(L15,6)=\"MASTER\",3,IF(RIGHT(L15,7)=\"EXTREME\",2,IF(RIGHT(L15,8)=\"ADVANCED\",1,0))),0)/100)","v":""}]
[null,null,null,null,null,null,"","",{"$f":"IF(B16=\"\",\"\",VLOOKUP(B16,difficulty!$A$3:$M$849,IF(LEFT(C16,6)=\"GUITAR\",2,IF(LEFT(C16,4)=\"BASS\",6,10))+IF(RIGHT(C16,6)=\"MASTER\",3,IF(RIGHT(C16,7)=\"EXTREME\",2,IF(RIGHT(C16,8)=\"ADVANCED\",1,0))),0)/100)","v":""},null,null,null,null,null,null,"","",{"$f":"IF(K16=\"\",\"\",VLOOKUP(K16,difficulty!$A$3:$M$849,IF(LEFT(L16,6)=\"GUITAR\",2,IF(LEFT(L16,4)=\"BASS\",6,10))+IF(RIGHT(L16,6)=\"MASTER\",3,IF(RIGHT(L16,7)=\"EXTREME\",2,IF(RIGHT(L16,8)=\"ADVANCED\",1,0))),0)/100)","v":""}]
[null,null,null,null,null,null,"","",{"$f":"IF(B17=\"\",\"\",VLOOKUP(B17,difficulty!$A$3:$M$849,IF(LEFT(C17,6)=\"GUITAR\",2,IF(LEFT(C17,4)=\"BASS\",6,10))+IF(RIGHT(C17,6)=\"MASTER\",3,IF(RIGHT(C17,7)=\"EXTREME\",2,IF(RIGHT(C17,8)=\"ADVANCED\",1,0))),0)/100)","v":""},null,null,null,null,null,null,"","",{"$f":"IF(K17=\"\",\"\",VLOOKUP(K17,difficulty!$A$3:$M$849,IF(LEFT(L17,6)=\"GUITAR\",2,IF(LEFT(L17,4)=\"BASS\",6,10))+IF(RIGHT(L17,6)=\"MASTER\",3,IF(RIGHT(L17,7)=\"EXTREME\",2,IF(RIGHT(L17,8)=\"ADVANCED\",1,0))),0)/100)","v":""}]
[null,null,null,null,null,null,"","",{"$f":"IF(B18=\"\",\"\",VLOOKUP(B18,difficulty!$A$3:$M$849,IF(LEFT(C18,6)=\"GUITAR\",2,IF(LEFT(C18,4)=\"BASS\",6,10))+IF(RIGHT(C18,6)=\"MASTER\",3,IF(RIGHT(C18,7)=\"EXTREME\",2,IF(RIGHT(C18,8)=\"ADVANCED\",1,0))),0)/100)","v":""},null,null,null,null,null,null,"","",{"$f":"IF(K18=\"\",\"\",VLOOKUP(K18,difficulty!$A$3:$M$849,IF(LEFT(L18,6)=\"GUITAR\",2,IF(LEFT(L18,4)=\"BASS\",6,10))+IF(RIGHT(L18,6)=\"MASTER\",3,IF(RIGHT(L18,7)=\"EXTREME\",2,IF(RIGHT(L18,8)=\"ADVANCED\",1,0))),0)/100)","v":""}]
[null,null,null,null,null,null,"","",{"$f":"IF(B19=\"\",\"\",VLOOKUP(B19,difficulty!$A$3:$M$849,IF(LEFT(C19,6)=\"GUITAR\",2,IF(LEFT(C19,4)=\"BASS\",6,10))+IF(RIGHT(C19,6)=\"MASTER\",3,IF(RIGHT(C19,7)=\"EXTREME\",2,IF(RIGHT(C19,8)=\"ADVANCED\",1,0))),0)/100)","v":""},null,null,null,null,null,null,"","",{"$f":"IF(K19=\"\",\"\",VLOOKUP(K19,difficulty!$A$3:$M$849,IF(LEFT(L19,6)=\"GUITAR\",2,IF(LEFT(L19,4)=\"BASS\",6,10))+IF(RIGHT(L19,6)=\"MASTER\",3,IF(RIGHT(L19,7)=\"EXTREME\",2,IF(RIGHT(L19,8)=\"ADVANCED\",1,0))),0)/100)","v":""}]
[null,null,null,null,null,null,"","",{"$f":"IF(B20=\"\",\"\",VLOOKUP(B20,difficulty!$A$3:$M$849,IF(LEFT(C20,6)=\"GUITAR\",2,IF(LEFT(C20,4)=\"BASS\",6,10))+IF(RIGHT(C20,6)=\"MASTER\",3,IF(RIGHT(C20,7)=\"EXTREME\",2,IF(RIGHT(C20,8)=\"ADVANCED\",1,0))),0)/100)","v":""},null,null,null,null,null,null,"","",{"$f":"IF(K20=\"\",\"\",VLOOKUP(K20,difficulty!$A$3:$M$849,IF(LEFT(L20,6)=\"GUITAR\",2,IF(LEFT(L20,4)=\"BASS\",6,10))+IF(RIGHT(L20,6)=\"MASTER\",3,IF(RIGHT(L20,7)=\"EXTREME\",2,IF(RIGHT(L20,8)=\"ADVANCED\",1,0))),0)/100)","v":""}]
[null,null,null,null,null,null,"","",{"$f":"IF(B21=\"\",\"\",VLOOKUP(B21,difficulty!$A$3:$M$849,IF(LEFT(C21,6)=\"GUITAR\",2,IF(LEFT(C21,4)=\"BASS\",6,10))+IF(RIGHT(C21,6)=\"MASTER\",3,IF(RIGHT(C21,7)=\"EXTREME\",2,IF(RIGHT(C21,8)=\"ADVANCED\",1,0))),0)/100)","v":""},null,null,null,null,null,null,"","",{"$f":"IF(K21=\"\",\"\",VLOOKUP(K21,difficulty!$A$3:$M$849,IF(LEFT(L21,6)=\"GUITAR\",2,IF(LEFT(L21,4)=\"BASS\",6,10))+IF(RIGHT(L21,6)=\"MASTER\",3,IF(RIGHT(L21,7)=\"EXTREME\",2,IF(RIGHT(L21,8)=\"ADVANCED\",1,0))),0)/100)","v":""}]
[null,null,null,null,null,null,"","",{"$f":"IF(B22=\"\",\"\",VLOOKUP(B22,difficulty!$A$3:$M$849,IF(LEFT(C22,6)=\"GUITAR\",2,IF(LEFT(C22,4)=\"BASS\",6,10))+IF(RIGHT(C22,6)=\"MASTER\",3,IF(RIGHT(C22,7)=\"EXTREME\",2,IF(RIGHT(C22,8)=\"ADVANCED\",1,0))),0)/100)","v":""},null,null,null,null,null,null,"","",{"$f":"IF(K22=\"\",\"\",VLOOKUP(K22,difficulty!$A$3:$M$849,IF(LEFT(L22,6)=\"GUITAR\",2,IF(LEFT(L22,4)=\"BASS\",6,10))+IF(RIGHT(L22,6)=\"MASTER\",3,IF(RIGHT(L22,7)=\"EXTREME\",2,IF(RIGHT(L22,8)=\"ADVANCED\",1,0))),0)/100)","v":""}]
[null,null,null,null,null,null,"","",{"$f":"IF(B23=\"\",\"\",VLOOKUP(B23,difficulty!$A$3:$M$849,IF(LEFT(C23,6)=\"GUITAR\",2,IF(LEFT(C23,4)=\"BASS\",6,10))+IF(RIGHT(C23,6)=\"MASTER\",3,IF(RIGHT(C23,7)=\"EXTREME\",2,IF(RIGHT(C23,8)=\"ADVANCED\",1,0))),0)/100)","v":""},null,null,null,null,null,null,"","",{"$f":"IF(K23=\"\",\"\",VLOOKUP(K23,difficulty!$A$3:$M$849,IF(LEFT(L23,6)=\"GUITAR\",2,IF(LEFT(L23,4)=\"BASS\",6,10))+IF(RIGHT(L23,6)=\"MASTER\",3,IF(RIGHT(L23,7)=\"EXTREME\",2,IF(RIGHT(L23,8)=\"ADVANCED\",1,0))),0)/100)","v":""}]
[null,null,null,null,null,null,"","",{"$f":"IF(B24=\"\",\"\",VLOOKUP(B24,difficulty!$A$3:$M$849,IF(LEFT(C24,6)=\"GUITAR\",2,IF(LEFT(C24,4)=\"BASS\",6,10))+IF(RIGHT(C24,6)=\"MASTER\",3,IF(RIGHT(C24,7)=\"EXTREME\",2,IF(RIGHT(C24,8)=\"ADVANCED\",1,0))),0)/100)","v":""},null,null,null,null,null,null,"","",{"$f":"IF(K24=\"\",\"\",VLOOKUP(K24,difficulty!$A$3:$M$849,IF(LEFT(L24,6)=\"GUITAR\",2,IF(LEFT(L24,4)=\"BASS\",6,10))+IF(RIGHT(L24,6)=\"MASTER\",3,IF(RIGHT(L24,7)=\"EXTREME\",2,IF(RIGHT(L24,8)=\"ADVANCED\",1,0))),0)/100)","v":""}]
[null,null,null,null,null,null,"","",{"$f":"IF(B25=\"\",\"\",VLOOKUP(B25,difficulty!$A$3:$M$849,IF(LEFT(C25,6)=\"GUITAR\",2,IF(LEFT(C25,4)=\"BASS\",6,10))+IF(RIGHT(C25,6)=\"MASTER\",3,IF(RIGHT(C25,7)=\"EXTREME\",2,IF(RIGHT(C25,8)=\"ADVANCED\",1,0))),0)/100)","v":""},null,null,null,null,null,null,"","",{"$f":"IF(K25=\"\",\"\",VLOOKUP(K25,difficulty!$A$3:$M$849,IF(LEFT(L25,6)=\"GUITAR\",2,IF(LEFT(L25,4)=\"BASS\",6,10))+IF(RIGHT(L25,6)=\"MASTER\",3,IF(RIGHT(L25,7)=\"EXTREME\",2,IF(RIGHT(L25,8)=\"ADVANCED\",1,0))),0)/100)","v":""}]
[null,null,null,null,null,null,"","",{"$f":"IF(B26=\"\",\"\",VLOOKUP(B26,difficulty!$A$3:$M$849,IF(LEFT(C26,6)=\"GUITAR\",2,IF(LEFT(C26,4)=\"BASS\",6,10))+IF(RIGHT(C26,6)=\"MASTER\",3,IF(RIGHT(C26,7)=\"EXTREME\",2,IF(RIGHT(C26,8)=\"ADVANCED\",1,0))),0)/100)","v":""},null,null,null,null,null,null,"","",{"$f":"IF(K26=\"\",\"\",VLOOKUP(K26,difficulty!$A$3:$M$849,IF(LEFT(L26,6)=\"GUITAR\",2,IF(LEFT(L26,4)=\"BASS\",6,10))+IF(RIGHT(L26,6)=\"MASTER\",3,IF(RIGHT(L26,7)=\"EXTREME\",2,IF(RIGHT(L26,8)=\"ADVANCED\",1,0))),0)/100)","v":""}]
[null,null,null,null,null,null,"","",{"$f":"IF(B27=\"\",\"\",VLOOKUP(B27,difficulty!$A$3:$M$849,IF(LEFT(C27,6)=\"GUITAR\",2,IF(LEFT(C27,4)=\"BASS\",6,10))+IF(RIGHT(C27,6)=\"MASTER\",3,IF(RIGHT(C27,7)=\"EXTREME\",2,IF(RIGHT(C27,8)=\"ADVANCED\",1,0))),0)/100)","v":""},null,null,null,null,null,null,"","",{"$f":"IF(K27=\"\",\"\",VLOOKUP(K27,difficulty!$A$3:$M$849,IF(LEFT(L27,6)=\"GUITAR\",2,IF(LEFT(L27,4)=\"BASS\",6,10))+IF(RIGHT(L27,6)=\"MASTER\",3,IF(RIGHT(L27,7)=\"EXTREME\",2,IF(RIGHT(L27,8)=\"ADVANCED\",1,0))),0)/100)","v":""}]
[null,null,null,null,null,null,"","",{"$f":"IF(B28=\"\",\"\",VLOOKUP(B28,difficulty!$A$3:$M$849,IF(LEFT(C28,6)=\"GUITAR\",2,IF(LEFT(C28,4)=\"BASS\",6,10))+IF(RIGHT(C28,6)=\"MASTER\",3,IF(RIGHT(C28,7)=\"EXTREME\",2,IF(RIGHT(C28,8)=\"ADVANCED\",1,0))),0)/100)","v":""},null,null,null,null,null,null,"","",{"$f":"IF(K28=\"\",\"\",VLOOKUP(K28,difficulty!$A$3:$M$849,IF(LEFT(L28,6)=\"GUITAR\",2,IF(LEFT(L28,4)=\"BASS\",6,10))+IF(RIGHT(L28,6)=\"MASTER\",3,IF(RIGHT(L28,7)=\"EXTREME\",2,IF(RIGHT(L28,8)=\"ADVANCED\",1,0))),0)/100)","v":""}]
[null,null,null,null,null,null,"","",{"$f":"IF(B29=\"\",\"\",VLOOKUP(B29,difficulty!$A$3:$M$849,IF(LEFT(C29,6)=\"GUITAR\",2,IF(LEFT(C29,4)=\"BASS\",6,10))+IF(RIGHT(C29,6)=\"MASTER\",3,IF(RIGHT(C29,7)=\"EXTREME\",2,IF(RIGHT(C29,8)=\"ADVANCED\",1,0))),0)/100)","v":""},null,null,null,null,null,null,"","",{"$f":"IF(K29=\"\",\"\",VLOOKUP(K29,difficulty!$A$3:$M$849,IF(LEFT(L29,6)=\"GUITAR\",2,IF(LEFT(L29,4)=\"BASS\",6,10))+IF(RIGHT(L29,6)=\"MASTER\",3,IF(RIGHT(L29,7)=\"EXTREME\",2,IF(RIGHT(L29,8)=\"ADVANCED\",1,0))),0)/100)","v":""}]
[null,null,null,null,null,null,"","",{"$f":"IF(B30=\"\",\"\",VLOOKUP(B30,difficulty!$A$3:$M$849,IF(LEFT(C30,6)=\"GUITAR\",2,IF(LEFT(C30,4)=\"BASS\",6,10))+IF(RIGHT(C30,6)=\"MASTER\",3,IF(RIGHT(C30,7)=\"EXTREME\",2,IF(RIGHT(C30,8)=\"ADVANCED\",1,0))),0)/100)","v":""},null,null,null,null,null,null,"","",{"$f":"IF(K30=\"\",\"\",VLOOKUP(K30,difficulty!$A$3:$M$849,IF(LEFT(L30,6)=\"GUITAR\",2,IF(LEFT(L30,4)=\"BASS\",6,10))+IF(RIGHT(L30,6)=\"MASTER\",3,IF(RIGHT(L30,7)=\"EXTREME\",2,IF(RIGHT(L30,8)=\"ADVANCED\",1,0))),0)/100)","v":""}]
[null,null,null,null,null,null,"","",{"$f":"IF(B31=\"\",\"\",VLOOKUP(B31,difficulty!$A$3:$M$849,IF(LEFT(C31,6)=\"GUITAR\",2,IF(LEFT(C31,4)=\"BASS\",6,10))+IF(RIGHT(C31,6)=\"MASTER\",3,IF(RIGHT(C31,7)=\"EXTREME\",2,IF(RIGHT(C31,8)=\"ADVANCED\",1,0))),0)/100)","v":""},null,null,null,null,null,null,"","",{"$f":"IF(K31=\"\",\"\",VLOOKUP(K31,difficulty!$A$3:$M$849,IF(LEFT(L31,6)=\"GUITAR\",2,IF(LEFT(L31,4)=\"BASS\",6,10))+IF(RIGHT(L31,6)=\"MASTER\",3,IF(RIGHT(L31,7)=\"EXTREME\",2,IF(RIGHT(L31,8)=\"ADVANCED\",1,0))),0)/100)","v":""}]

{"sheet":"difficulty","index":1,"n_rows":849,"n_cols":13,"rows_kept":849,"cut":false,"hidden":false,"merged":[]}
[null,"GF",null,null,null,"BASS",null,null,null,"DM"]
["曲名","BSC","ADV","EXT","MST","BSC","ADV","EXT","MST","BSC","ADV","EXT","MST"]
["777",295,460,685,null,290,465,630,null,350,515,745]
["10,000,000,000",315,490,600,710,365,440,560,735,350,530,795,895]
["☆shining☆（GF&dm style）",360,540,595,null,220,395,445,null,250,460,570]
["†渚の小悪魔ラヴリィ～レイディオ† (GITADORA ver.)",240,395,675,null,150,435,675,null,180,410,760]
["0時20分のRoulette",295,550,685,null,310,465,585,null,210,345,650]
["1/n",325,480,625,null,360,400,485,null,205,460,650]
["101回目の呪い",140,240,560,null,140,360,550,null,140,350,675]
["3 A.M. ディテクティブ・ゲーム",255,415,620,910,180,385,645,680,180,360,550,670]
["8 -eight-",185,480,855,null,225,460,830,null,255,450,830]
["800nm",175,385,610,null,210,440,720,null,245,505,755]
["A SHOOTING STAR",320,615,780,null,280,545,695,null,325,455,735]
["A.DOGMA",395,650,890,955,445,740,895,960,675,850,955,990]
["Across the nightmare",405,450,565,null,null,null,null,null,325,455,620]
["Adrenaline",330,425,570,null,320,390,535,null,305,435,625]
["Adverse Criticism",400,595,855,null,370,630,825,null,435,620,805]
["AFTER A HARD DAY",270,620,770,null,280,570,695,null,320,505,700]
["Agnus Dei",315,410,585,735,300,445,505,645,460,575,745,855]
["Aithon",315,580,700,null,360,465,535,null,380,475,590]
["Alternative Tactics, Second Urgent Issue",240,395,685,810,280,370,560,675,170,415,650,745]
["Anathema",440,600,845,950,450,645,820,885,415,665,885,975]
["ancient breeze",435,615,820,null,395,550,630,null,465,620,800]
["Anti Pleasure ～快楽主義者の憂鬱～",210,465,665,null,310,460,685,null,255,470,635]
["AREA 51",325,460,685,null,345,465,550,null,255,450,755]
["Arena Sexarboris",310,590,865,null,340,585,795,null,255,650,825]
["Around 40",465,630,865,null,425,600,730,null,355,440,920]
["Arx Tyranni",265,365,630,815,210,335,570,655,305,440,585,700]
["Ascetic",310,410,570,625,345,440,545,595,480,600,830,860]
["Atalante",330,635,920,null,315,445,575,null,365,560,785]
["ATOMS",325,460,715,null,290,430,530,null,300,455,680]
["Awaken Ver.G",305,415,720,null,255,465,685,null,305,395,750]
["AXIS",415,595,760,null,410,540,680,null,365,580,755]
["Bangin' Breaks",450,655,910,null,465,790,940,null,355,520,740]
["Beautiful Dream",190,450,620,null,195,395,540,null,250,520,780]
["Before Daybreak",190,465,735,null,400,560,880,null,345,580,865]
["BEFORE I DECAY",350,745,815,null,360,670,810,null,220,350,730]
["begin",340,435,580,null,330,495,600,null,195,505,695]
["Believing",325,405,550,null,325,400,525,null,180,390,630]
["BELLS",160,460,635,770,180,480,545,685,290,455,730,850]
["Big Wave",200,370,555,null,250,390,630,null,250,420,630]
["Black horizon",380,680,840,null,405,635,760,null,450,590,735]
["Blaze",310,395,675,940,320,420,545,600,355,460,690,810]
["BLUE BOOTS",270,395,795,null,195,395,755,null,345,500,840]
["BLUE FLAME",280,390,570,null,280,410,535,null,250,465,590]
["Blue Forest",585,750,895,905,595,720,800,825,510,580,760,810]
["blue moon",350,460,695,945,380,455,710,835,435,635,825,915]
["Blue planet",460,580,810,null,435,515,730,null,330,575,695]
["BOBBY SUE AND SKINNY JIM",330,440,620,null,330,435,625,null,320,555,695]
["Born to be",190,410,575,null,295,460,565,null,155,375,645]
["Brazilian Anthem",370,465,700,null,335,405,565,null,530,655,790]
["BRE∀K DOWN! (GF&DM STYLE)",335,465,535,null,270,425,550,null,195,505,625]
["BRIGHT STREAM",140,465,610,null,345,440,530,null,120,460,635]
["Brown blizzard",375,580,815,965,400,540,745,925,510,675,885,980]
["Burning Cremation",185,405,580,810,240,460,570,715,305,440,690,820]
["Butterfly Effect",160,350,560,720,225,330,430,565,210,345,540,680]
["cachaca",365,470,620,null,335,400,500,null,425,570,680]
["CALAMITY PHOENIX",495,680,800,840,385,580,755,915,415,635,795,850]
["CAPTAIN'S VOYAGE",185,410,590,null,190,360,540,null,260,435,700]
["CaptivAte～裁き～",365,505,625,null,390,645,835,null,370,505,620]
["CARNIVAL DAY",315,460,575,null,340,480,610,null,365,600,740]
["CASSANDRA",355,430,520,null,190,345,445,null,290,460,625]
["Cassis",195,410,630,null,185,430,620,null,290,490,810]
["Catharsis Garden",330,595,720,null,365,570,685,null,290,370,650]
["CHAIN REACTION feat.NO+CHIN",325,465,595,null,360,470,650,null,285,625,730]
["Chance",310,380,575,null,320,410,495,null,340,450,630]
["chAngE",135,385,480,null,200,390,465,null,160,285,510]
["Charismatic",225,375,585,null,195,350,590,null,210,490,665]
["Cherry",320,460,740,null,295,440,665,null,340,495,770]
["CHIMERA",220,460,710,850,null,null,null,null,280,410,585,760]
["Chinese Snowy Dance",460,570,760,945,515,610,760,930,420,595,840,920]
["CHOCOLATE PHILOSOPHY",305,500,625,null,300,405,470,null,355,475,665]
["Chronos",465,565,695,820,360,525,630,790,425,485,650,815]
["CLASSIC PARTY",330,565,635,null,315,390,485,null,290,530,600]
["CLASSIC PARTY 2",410,535,745,null,270,410,590,null,300,525,640]
["CLASSIC PARTY 3",460,750,880,null,360,505,540,null,380,505,560]
["Cleopatrysm",225,375,745,null,175,380,755,null,180,550,865]
["cockpit",320,435,680,820,295,375,605,740,435,630,805,910]
["Colors",305,465,650,null,260,360,580,null,340,440,650]
["Come Back Alive",320,380,575,null,325,370,715,null,365,475,965]
["Concertino in Blue",495,795,955,995,465,630,835,935,620,735,830,905]
["concon～INAReMIX～",120,450,575,null,310,395,525,null,105,510,845]
["Confession",230,445,550,null,250,460,535,null,165,360,660]
["cosmic agenda",305,415,645,null,330,470,645,null,230,470,740]
["COSMIC COWGIRL",335,445,570,null,310,410,450,null,435,545,660]
["Cosmic Hurricane (GFDM ver.)",280,420,615,735,185,355,530,635,320,505,760,850]
["Covered With The Wire",280,365,555,815,210,345,560,755,225,470,645,865]
["Crack",295,490,665,null,345,445,665,null,305,425,750]
["Crazy blooms",335,500,730,855,355,490,735,770,335,470,700,800]
["Croquette",335,455,550,null,315,400,505,null,245,410,570]
["Crystal Toybox",265,470,840,null,165,460,710,null,250,550,810]
["Cutie pie",155,245,355,null,null,null,null,null,240,385,480]
["DAWN",470,675,930,null,455,675,890,null,390,660,835]
["DAY DREAM",525,645,830,995,515,635,810,940,570,695,890,990]
["Day's!",265,605,735,null,375,560,750,null,255,485,760]
["DEATH BRINGER",325,530,675,785,355,465,590,720,415,475,740,875]
["Deep Deep Inside",145,355,675,895,180,325,600,770,150,480,655,810]
["Deep Forest",360,500,775,null,390,435,545,null,310,455,665]
["DEMON SLAYER",225,430,750,920,325,430,645,780,365,510,695,810]
["DEPARTURE",305,465,710,770,null,null,null,null,280,430,645,830]
["Depend on me",null,null,null,null,null,null,null,null,210,425,615]
["Desert Rose",385,540,685,null,345,525,655,null,385,560,675]
["DESTINY",310,535,790,null,305,495,735,null,300,550,875]
["Destiny lovers",345,525,695,null,345,560,650,null,375,625,745]
["Destiny Wings",270,540,720,800,260,420,595,710,255,470,675,805]
["Devil Fish Dumpling",350,650,865,null,385,620,820,null,355,540,850]
["DIAMONDS",100,290,470,null,145,325,515,null,140,410,450]
["Die Zauberflote",310,410,690,790,295,400,625,720,515,610,740,860]
["DIGITAL GIRL",270,455,605,null,295,485,615,null,330,475,725]
["Don't Break Up",320,490,845,null,240,550,820,null,225,395,850]
["DOUBLE IMPACT",290,460,815,null,340,505,885,null,375,520,800]
["double thrash",195,425,635,965,185,420,580,740,195,450,715,885]
["Dragon Blade",400,580,825,null,365,540,650,null,360,490,630]
["DRAGON KILLER",280,465,875,null,330,560,810,null,240,430,690]
["Dragontail Butterfly",270,475,665,null,315,465,630,null,225,625,785]
["Dream Again...",310,400,675,null,330,555,695,null,245,430,560]
["Dreams in the night",130,320,470,585,null,null,null,null,145,355,575,645]
["Driven Shooter",410,825,955,null,425,690,775,null,385,565,740]
["drop",310,435,550,null,195,370,490,null,340,540,695]
["dye it white",255,465,720,null,225,470,655,null,160,480,730]
{"$rows_left_out":729}